Installation de Caffe sur Ubuntu 14.04. Coincé dans la dernière étape

Je me suis battu avec Caffe pendant deux jours et j’ai toujours été bloqué à l’étape du test. Pour plus de détails, veuillez regarder le code.

LD -o .build_release/lib/libcaffe.so.1.0.0-rc3 /usr/bin/ld: /usr/local/lib/libglog.a(libglog_la-logging.o): relocation R_X86_64_32S against `_ZTVN6google4base6LoggerE' can not be used when making a shared object; recomstack with -fPIC /usr/local/lib/libglog.a: error adding symbols: Bad value collect2: error: ld returned 1 exit status make: *** [.build_release/lib/libcaffe.so.1.0.0-rc3] Error 1 

Je suis nouveau à cela et ne peux pas vraiment savoir ce que je devrais faire. Y a-t-il quelqu’un qui a rencontré ce problème? S’il vous plaît, aidez-moi à résoudre ce problème. N’importe quelle idée est la bienvenue.